Reaction Details
TargetTryptophan 2,3-dioxygenase
LigandBDBM50127203
Substrate/Competitorn/a
Meas. Tech.ChEMBL_1524691 (CHEMBL3631085)
IC50 116±n/a nM
Citation Wu, JSLin, SYLiao, FYHsiao, WCLee, LCPeng, YHHsieh, CLWu, MHSong, JSYueh, AChen, CHYeh, SHLiu, CYLin, SYYeh, TKHsu, JTShih, CUeng, SHHung, MSWu, SY Identification of Substituted Naphthotriazolediones as Novel Tryptophan 2,3-Dioxygenase (TDO) Inhibitors through Structure-Based Virtual Screening. J Med Chem58:7807-19 (2015) 
 
Tryptophan 2,3-dioxygenase
Name:Tryptophan 2,3-dioxygenase
Type:PROTEIN
Mol. Mass.:47874.48
Organism:Homo sapiens (Human)
Description:ChEMBL_825691
Residue:406
BDBM50127203
NameBDBM50127203
Synonyms:CHEMBL3628601
TypeSmall organic molecule
Emp. Form.C22H18N4O4
Mol. Mass.402.4027
SMILESO=C(N1CCOCC1)c1ccc(Cn2nnc3c2C(=O)c2ccccc2C3=O)cc1