Reaction Details
TargetIndoleamine 2,3-dioxygenase 1
LigandBDBM50127137
Substrate/Competitorn/a
Meas. Tech.ChEMBL_1524692 (CHEMBL3631086)
IC50 2587±n/a nM
Citation Wu, JSLin, SYLiao, FYHsiao, WCLee, LCPeng, YHHsieh, CLWu, MHSong, JSYueh, AChen, CHYeh, SHLiu, CYLin, SYYeh, TKHsu, JTShih, CUeng, SHHung, MSWu, SY Identification of Substituted Naphthotriazolediones as Novel Tryptophan 2,3-Dioxygenase (TDO) Inhibitors through Structure-Based Virtual Screening. J Med Chem58:7807-19 (2015) 
 
Indoleamine 2,3-dioxygenase 1
Name:Indoleamine 2,3-dioxygenase 1
Type:Enzyme
Mol. Mass.:45330.80
Organism:Homo sapiens (Human)
Description:P14902
Residue:403
BDBM50127137
NameBDBM50127137
Synonyms:CHEMBL3628552
TypeSmall organic molecule
Emp. Form.C17H10FN3O2
Mol. Mass.307.2786
SMILESFc1ccc(Cn2nnc3c2C(=O)c2ccccc2C3=O)cc1