Reaction Details
TargetTyrosine-protein phosphatase non-receptor type 1
LigandBDBM50127135
Substrate/Competitorn/a
Meas. Tech.ChEMBL_1524697 (CHEMBL3631091)
IC50>10000±n/a nM
Citation Wu, JSLin, SYLiao, FYHsiao, WCLee, LCPeng, YHHsieh, CLWu, MHSong, JSYueh, AChen, CHYeh, SHLiu, CYLin, SYYeh, TKHsu, JTShih, CUeng, SHHung, MSWu, SY Identification of Substituted Naphthotriazolediones as Novel Tryptophan 2,3-Dioxygenase (TDO) Inhibitors through Structure-Based Virtual Screening. J Med Chem58:7807-19 (2015) 
 
Tyrosine-protein phosphatase non-receptor type 1
Name:Tyrosine-protein phosphatase non-receptor type 1
Type:Protein phosphatase
Mol. Mass.:49963.76
Organism:Homo sapiens (Human)
Description:Human recombinant GST-fusion PTP1B (1-435).
Residue:435
BDBM50127135
NameBDBM50127135
Synonyms:CHEMBL3628551
TypeSmall organic molecule
Emp. Form.C17H10ClN3O2
Mol. Mass.323.733
SMILESClc1cccc(Cn2nnc3c2C(=O)c2ccccc2C3=O)c1