Reaction Details
TargetXanthine dehydrogenase/oxidase
LigandBDBM50320491
Substrate/Competitorn/a
Meas. Tech.ChEMBL_1522406 (CHEMBL3631301)
IC50 10.0±n/a nM
Citation Chen, SZhang, TWang, JWang, FNiu, HWu, CWang, S Synthesis and evaluation of 1-hydroxy/methoxy-4-methyl-2-phenyl-1H-imidazole-5-carboxylic acid derivatives as non-purine xanthine oxidase inhibitors. Eur J Med Chem103:343-53 (2015) 
 
Xanthine dehydrogenase/oxidase
Name:Xanthine dehydrogenase/oxidase
Type:Protein
Mol. Mass.:146809.00
Organism:Bos taurus (Bovine)
Description:P80457
Residue:1332
BDBM50320491
NameBDBM50320491
Synonyms:2-(3-CYANO-4-ISOBUTOXY-PHENYL)-4-METHYL-5-THIAZOLE-CARBOXYLIC ACID FEBUXOSTAT | US11744839, Compound of formula 5
TypeSmall organic molecule
Emp. Form.C16H16N2O3S
Mol. Mass.316.375
SMILESCC(C)COc1ccc(cc1C#N)-c1nc(C)c(s1)C(O)=O