Reaction Details
TargetNeuronal acetylcholine receptor subunit alpha-7
LigandBDBM50127658
Substrate/Competitorn/a
Meas. Tech.ChEMBL_1522501 (CHEMBL3631637)
Ki 110000±n/a nM
Citation Deligia, FDeiana, VGotti, CLazzari, PBottazzi, MEPucci, LFasoli, FRagusa, GPinna, GAMurineddu, G Design of novel 3,6-diazabicyclo[3.1.1]heptane derivatives with potent and selective affinities fora4ß2 neuronal nicotinic acetylcholine receptors. Eur J Med Chem103:429-37 (2015) 
 
Neuronal acetylcholine receptor subunit alpha-7
Name:Neuronal acetylcholine receptor subunit alpha-7
Type:Enzyme
Mol. Mass.:56502.44
Organism:Rattus norvegicus (Rat)
Description:Q05941
Residue:502
BDBM50127658
NameBDBM50127658
Synonyms:CHEMBL3628499
TypeSmall organic molecule
Emp. Form.C16H16FN3
Mol. Mass.269.3167
SMILESFc1ccc(cc1)-c1cncc(c1)N1CC2CC(C1)N2