Reaction Details
TargetNeuronal acetylcholine receptor subunit alpha-7
LigandBDBM50127663
Substrate/Competitorn/a
Meas. Tech.ChEMBL_1522501 (CHEMBL3631637)
Ki 5000±n/a nM
Citation Deligia, FDeiana, VGotti, CLazzari, PBottazzi, MEPucci, LFasoli, FRagusa, GPinna, GAMurineddu, G Design of novel 3,6-diazabicyclo[3.1.1]heptane derivatives with potent and selective affinities fora4ß2 neuronal nicotinic acetylcholine receptors. Eur J Med Chem103:429-37 (2015) 
 
Neuronal acetylcholine receptor subunit alpha-7
Name:Neuronal acetylcholine receptor subunit alpha-7
Type:Enzyme
Mol. Mass.:56502.44
Organism:Rattus norvegicus (Rat)
Description:Q05941
Residue:502
BDBM50127663
NameBDBM50127663
Synonyms:CHEMBL3628504
TypeSmall organic molecule
Emp. Form.C16H16N4O2
Mol. Mass.296.3238
SMILES[O-][N+](=O)c1ccc(cc1)-c1cncc(c1)N1CC2CC(C1)N2