Reaction Details
TargetBeta-galactoside alpha-2,6-sialyltransferase 1
LigandBDBM50127709
Substrate/Competitorn/a
Meas. Tech.ChEMBL_1522838 (CHEMBL3630397)
Ki 5852±n/a nM
Citation Li, WNiu, YXiong, DCCao, XYe, XS Highly Substituted Cyclopentane-CMP Conjugates as Potent Sialyltransferase Inhibitors. J Med Chem58:7972-90 (2015) 
 
Beta-galactoside alpha-2,6-sialyltransferase 1
Name:Beta-galactoside alpha-2,6-sialyltransferase 1
Type:PROTEIN
Mol. Mass.:46622.19
Organism:Homo sapiens (Human)
Description:ChEMBL_109837
Residue:406
BDBM50127709
NameBDBM50127709
Synonyms:CHEMBL3629689
TypeSmall organic molecule
Emp. Form.C15H22N3Na3O11P2
Mol. Mass.551.2655
SMILES[Na+].[Na+].[Na+].Nc1ccn([C@@H]2O[C@H](COP([O-])(=O)OC(C3CCCC3)P([O-])([O-])=O)[C@@H](O)[C@H]2O)c(=O)n1