Reaction Details
TargetGlycogen synthase kinase-3 beta
LigandBDBM50128294
Substrate/Competitorn/a
Meas. Tech.ChEMBL_1523702 (CHEMBL3631841)
IC50 682000±n/a nM
Citation Patel, SHarris, SFGibbons, PDeshmukh, GGustafson, AKellar, TLin, HLiu, XLiu, YLiu, YMa, CScearce-Levie, KGhosh, ASShin, YGSolanoy, HWang, JWang, BYin, JSiu, MLewcock, JW Scaffold-Hopping and Structure-Based Discovery of Potent, Selective, And Brain Penetrant N-(1H-Pyrazol-3-yl)pyridin-2-amine Inhibitors of Dual Leucine Zipper Kinase (DLK, MAP3K12). J Med Chem58:8182-99 (2015) 
 
Glycogen synthase kinase-3 beta
Name:Glycogen synthase kinase-3 beta
Type:Enzyme
Mol. Mass.:46756.38
Organism:Homo sapiens (Human)
Description:P49841
Residue:420
BDBM50128294
NameBDBM50128294
Synonyms:CHEMBL3629013
TypeSmall organic molecule
Emp. Form.C22H28N6O
Mol. Mass.392.4973
SMILESN#Cc1ccnc(Nc2cc(C3CCN(CC3)C3COC3)n(n2)C2CCCC2)c1