Reaction Details
TargetMitogen-activated protein kinase kinase kinase 12
LigandBDBM50128333
Substrate/Competitorn/a
Meas. Tech.ChEMBL_1523510 (CHEMBL3631014)
IC50 721±n/a nM
Citation Patel, SHarris, SFGibbons, PDeshmukh, GGustafson, AKellar, TLin, HLiu, XLiu, YLiu, YMa, CScearce-Levie, KGhosh, ASShin, YGSolanoy, HWang, JWang, BYin, JSiu, MLewcock, JW Scaffold-Hopping and Structure-Based Discovery of Potent, Selective, And Brain Penetrant N-(1H-Pyrazol-3-yl)pyridin-2-amine Inhibitors of Dual Leucine Zipper Kinase (DLK, MAP3K12). J Med Chem58:8182-99 (2015) 
 
Mitogen-activated protein kinase kinase kinase 12
Name:Mitogen-activated protein kinase kinase kinase 12
Type:PROTEIN
Mol. Mass.:93216.56
Organism:Homo sapiens (Human)
Description:ChEMBL_1460553
Residue:859
BDBM50128333
NameBDBM50128333
Synonyms:CHEMBL3629014
TypeSmall organic molecule
Emp. Form.C22H26F2N6O
Mol. Mass.428.4782
SMILESFC1(F)CCC(C1)n1nc(Nc2cc(ccn2)C#N)cc1C1CCN(CC1)C1COC1