Reaction Details
TargetMitogen-activated protein kinase kinase kinase 12
LigandBDBM50128336
Substrate/Competitorn/a
Meas. Tech.ChEMBL_1523510 (CHEMBL3631014)
IC50 1400±n/a nM
Citation Patel, SHarris, SFGibbons, PDeshmukh, GGustafson, AKellar, TLin, HLiu, XLiu, YLiu, YMa, CScearce-Levie, KGhosh, ASShin, YGSolanoy, HWang, JWang, BYin, JSiu, MLewcock, JW Scaffold-Hopping and Structure-Based Discovery of Potent, Selective, And Brain Penetrant N-(1H-Pyrazol-3-yl)pyridin-2-amine Inhibitors of Dual Leucine Zipper Kinase (DLK, MAP3K12). J Med Chem58:8182-99 (2015) 
 
Mitogen-activated protein kinase kinase kinase 12
Name:Mitogen-activated protein kinase kinase kinase 12
Type:PROTEIN
Mol. Mass.:93216.56
Organism:Homo sapiens (Human)
Description:ChEMBL_1460553
Residue:859
BDBM50128336
NameBDBM50128336
Synonyms:CHEMBL3629017
TypeSmall organic molecule
Emp. Form.C22H28N6O
Mol. Mass.392.4973
SMILESN#Cc1ccnc(Nc2cc(C3CCN(CC3)C3COC3)n(CC3CCC3)n2)c1