Reaction Details
TargetCorticotropin-releasing factor receptor 1
LigandBDBM50128776
Substrate/Competitorn/a
Meas. Tech.ChEMBL_1522583 (CHEMBL3631936)
Ki 3.4±n/a nM
Citation Stehouwer, JSBourke, CHOwens, MJVoll, RJKilts, CDGoodman, MM Synthesis, binding affinity, radiolabeling, and microPET evaluation of 4-(2-substituted-4-substituted)-8-(dialkylamino)-6-methyl-1-substituted-3,4-dihydropyrido[2,3-b]pyrazin-2(1H)-ones as ligands for brain corticotropin-releasing factor type-1 (CRF1) receptors. Bioorg Med Chem Lett25:5111-4 (2015) 
 
Corticotropin-releasing factor receptor 1
Name:Corticotropin-releasing factor receptor 1
Type:Enzyme
Mol. Mass.:50744.31
Organism:Homo sapiens (Human)
Description:P34998
Residue:444
BDBM50128776
NameBDBM50128776
Synonyms:CHEMBL3628732
TypeSmall organic molecule
Emp. Form.C21H27IN4O
Mol. Mass.478.3698
SMILESCCCCN(CC)c1cc(C)nc2N(CC(=O)Nc12)c1ccc(I)cc1C