Reaction Details
TargetCorticotropin-releasing factor receptor 1
LigandBDBM20973
Substrate/Competitorn/a
Meas. Tech.ChEMBL_1522583 (CHEMBL3631936)
Ki 4.0±n/a nM
Citation Stehouwer, JSBourke, CHOwens, MJVoll, RJKilts, CDGoodman, MM Synthesis, binding affinity, radiolabeling, and microPET evaluation of 4-(2-substituted-4-substituted)-8-(dialkylamino)-6-methyl-1-substituted-3,4-dihydropyrido[2,3-b]pyrazin-2(1H)-ones as ligands for brain corticotropin-releasing factor type-1 (CRF1) receptors. Bioorg Med Chem Lett25:5111-4 (2015) 
 
Corticotropin-releasing factor receptor 1
Name:Corticotropin-releasing factor receptor 1
Type:Enzyme
Mol. Mass.:50744.31
Organism:Homo sapiens (Human)
Description:P34998
Residue:444
BDBM20973
NameBDBM20973
Synonyms:8-[butyl(ethyl)amino]-4-(4-methoxy-2-methylphenyl)-6-methyl-1H,2H,3H,4H-pyrido[2,3-b]pyrazin-2-one Pyridopyrazinone, 1a
TypeSmall organic molecule
Emp. Form.C22H30N4O2
Mol. Mass.382.4992
SMILESCCCCN(CC)c1cc(C)nc2N(CC(=O)Nc12)c1ccc(OC)cc1C