Reaction Details
TargetCorticotropin-releasing factor receptor 1
LigandBDBM50128784
Substrate/Competitorn/a
Meas. Tech.ChEMBL_1522583 (CHEMBL3631936)
Ki 180±n/a nM
Citation Stehouwer, JSBourke, CHOwens, MJVoll, RJKilts, CDGoodman, MM Synthesis, binding affinity, radiolabeling, and microPET evaluation of 4-(2-substituted-4-substituted)-8-(dialkylamino)-6-methyl-1-substituted-3,4-dihydropyrido[2,3-b]pyrazin-2(1H)-ones as ligands for brain corticotropin-releasing factor type-1 (CRF1) receptors. Bioorg Med Chem Lett25:5111-4 (2015) 
 
Corticotropin-releasing factor receptor 1
Name:Corticotropin-releasing factor receptor 1
Type:Enzyme
Mol. Mass.:50744.31
Organism:Homo sapiens (Human)
Description:P34998
Residue:444
BDBM50128784
NameBDBM50128784
Synonyms:CHEMBL3628741
TypeSmall organic molecule
Emp. Form.C19H23BrN4O
Mol. Mass.403.316
SMILESCC(C)c1ccc(N2CC(=O)Nc3c(cc(C)nc23)N(C)C)c(Br)c1