Reaction Details
TargetTransient receptor potential cation channel subfamily V member 1
LigandBDBM50128911
Substrate/Competitorn/a
Meas. Tech.ChEMBL_1522887 (CHEMBL3630760)
IC50 20±n/a nM
Citation Ann, JJung, AKim, MYKim, HMRyu, HKim, SKang, DWHong, SCui, MChoi, SBlumberg, PMFrank-Foltyn, RBahrenberg, GStockhausen, HChristoph, TLee, J Structure activity relationships of benzyl C-region analogs of 2-(3-fluoro-4-methylsulfonamidophenyl)propanamides as potent TRPV1 antagonists. Bioorg Med Chem23:6844-54 (2015) 
 
Transient receptor potential cation channel subfamily V member 1
Name:Transient receptor potential cation channel subfamily V member 1
Type:Protein
Mol. Mass.:94960.75
Organism:Homo sapiens (Human)
Description:Q8NER1
Residue:839
BDBM50128911
NameBDBM50128911
Synonyms:CHEMBL3627723
TypeSmall organic molecule
Emp. Form.C24H28F4N2O3S2
Mol. Mass.532.614
SMILESC[C@H](C(=O)NCc1ccc(cc1SC1CCCCC1)C(F)(F)F)c1ccc(NS(C)(=O)=O)c(F)c1