Reaction Details
TargetTransient receptor potential cation channel subfamily V member 1
LigandBDBM50398548
Substrate/Competitorn/a
Meas. Tech.ChEMBL_1522886 (CHEMBL3630759)
Ki 0.400000±n/a nM
Citation Ann, JJung, AKim, MYKim, HMRyu, HKim, SKang, DWHong, SCui, MChoi, SBlumberg, PMFrank-Foltyn, RBahrenberg, GStockhausen, HChristoph, TLee, J Structure activity relationships of benzyl C-region analogs of 2-(3-fluoro-4-methylsulfonamidophenyl)propanamides as potent TRPV1 antagonists. Bioorg Med Chem23:6844-54 (2015) 
 
Transient receptor potential cation channel subfamily V member 1
Name:Transient receptor potential cation channel subfamily V member 1
Type:Protein
Mol. Mass.:94960.75
Organism:Homo sapiens (Human)
Description:Q8NER1
Residue:839
BDBM50398548
NameBDBM50398548
Synonyms:CHEMBL2177405
TypeSmall organic molecule
Emp. Form.C23H25F7N4O3S
Mol. Mass.570.523
SMILESCC(C(=O)NCc1ccc(nc1N1CCC(CC1)C(F)(F)F)C(F)(F)F)c1ccc(NS(C)(=O)=O)c(F)c1