Reaction Details
TargetMetallo-beta-lactamase VIM-2
LigandBDBM50129065
Substrate/Competitorn/a
Meas. Tech.ChEMBL_1523078 (CHEMBL3631655)
IC50 1427000±n/a nM
Citation Christopeit, TCarlsen, TJHelland, RLeiros, HK Discovery of Novel Inhibitor Scaffolds against the Metallo-ß-lactamase VIM-2 by Surface Plasmon Resonance (SPR) Based Fragment Screening. J Med Chem58:8671-82 (2015) 
 
Metallo-beta-lactamase VIM-2
Name:Metallo-beta-lactamase VIM-2
Type:Protein
Mol. Mass.:28318.00
Organism:Pseudomonas aeruginosa (g-Proteobacteria)
Description:n/a
Residue:266
BDBM50129065
NameBDBM50129065
Synonyms:CHEMBL3278535
TypeSmall organic molecule
Emp. Form.C10H5NO2
Mol. Mass.171.1522
SMILESO=c1c(coc2ccccc12)C#N