Reaction Details
TargetMetallo-beta-lactamase VIM-2
LigandBDBM50129069
Substrate/Competitorn/a
Meas. Tech.ChEMBL_1523078 (CHEMBL3631655)
IC50>3000000±n/a nM
Citation Christopeit, TCarlsen, TJHelland, RLeiros, HK Discovery of Novel Inhibitor Scaffolds against the Metallo-ß-lactamase VIM-2 by Surface Plasmon Resonance (SPR) Based Fragment Screening. J Med Chem58:8671-82 (2015) 
 
Metallo-beta-lactamase VIM-2
Name:Metallo-beta-lactamase VIM-2
Type:Protein
Mol. Mass.:28318.00
Organism:Pseudomonas aeruginosa (g-Proteobacteria)
Description:n/a
Residue:266
BDBM50129069
NameBDBM50129069
Synonyms:CHEMBL3629239
TypeSmall organic molecule
Emp. Form.C15H12O3
Mol. Mass.240.254
SMILESCOC(=O)c1ccccc1C(=O)c1ccccc1