Reaction Details
TargetMetallo-beta-lactamase VIM-2
LigandBDBM50442179
Substrate/Competitorn/a
Meas. Tech.ChEMBL_1523078 (CHEMBL3631655)
IC50 592000±n/a nM
Citation Christopeit, TCarlsen, TJHelland, RLeiros, HK Discovery of Novel Inhibitor Scaffolds against the Metallo-ß-lactamase VIM-2 by Surface Plasmon Resonance (SPR) Based Fragment Screening. J Med Chem58:8671-82 (2015) 
 
Metallo-beta-lactamase VIM-2
Name:Metallo-beta-lactamase VIM-2
Type:Protein
Mol. Mass.:28318.00
Organism:Pseudomonas aeruginosa (g-Proteobacteria)
Description:n/a
Residue:266
BDBM50442179
NameBDBM50442179
Synonyms:CHEMBL2441619
TypeSmall organic molecule
Emp. Form.C15H16F3N3
Mol. Mass.295.3028
SMILESCc1ccc2nc(cc(N3CCNCC3)c2c1)C(F)(F)F