Reaction Details
TargetMetallo-beta-lactamase VIM-2
LigandBDBM50129066
Substrate/Competitorn/a
Meas. Tech.ChEMBL_1523080 (CHEMBL3631657)
Kd 229000±n/a nM
Citation Christopeit, TCarlsen, TJHelland, RLeiros, HK Discovery of Novel Inhibitor Scaffolds against the Metallo-ß-lactamase VIM-2 by Surface Plasmon Resonance (SPR) Based Fragment Screening. J Med Chem58:8671-82 (2015) 
 
Metallo-beta-lactamase VIM-2
Name:Metallo-beta-lactamase VIM-2
Type:Protein
Mol. Mass.:28318.00
Organism:Pseudomonas aeruginosa (g-Proteobacteria)
Description:n/a
Residue:266
BDBM50129066
NameBDBM50129066
Synonyms:CHEMBL3627736
TypeSmall organic molecule
Emp. Form.C11H5F3N2OS
Mol. Mass.270.23
SMILESOc1nc(cc(c1C#N)C(F)(F)F)-c1cccs1