Reaction Details
TargetMitogen-activated protein kinase kinase kinase 7
LigandBDBM50129085
Substrate/Competitorn/a
Meas. Tech.ChEMBL_1523179 (CHEMBL3632095)
IC50>30000±n/a nM
Citation Fakhouri, LEl-Elimat, THurst, DPReggio, PHPearce, CJOberlies, NHCroatt, MP Isolation, semisynthesis, covalent docking and transforming growth factor beta-activated kinase 1 (TAK1)-inhibitory activities of (5Z)-7-oxozeaenol analogues. Bioorg Med Chem23:6993-9 (2015) 
 
Mitogen-activated protein kinase kinase kinase 7
Name:Mitogen-activated protein kinase kinase kinase 7
Type:Protein
Mol. Mass.:67199.89
Organism:Homo sapiens (Human)
Description:O43318
Residue:606
BDBM50129085
NameBDBM50129085
Synonyms:CHEMBL3334712
TypeSmall organic molecule
Emp. Form.C19H24O5
Mol. Mass.332.3909
SMILESCOc1cc(O)cc2CC(=O)\C=C\CCCCC[C@H](C)OC(=O)c12