Reaction Details
TargetMitogen-activated protein kinase kinase kinase 7
LigandBDBM50042034
Substrate/Competitorn/a
Meas. Tech.ChEMBL_1523178 (CHEMBL3632094)
IC50 8.1±n/a nM
Citation Fakhouri, LEl-Elimat, THurst, DPReggio, PHPearce, CJOberlies, NHCroatt, MP Isolation, semisynthesis, covalent docking and transforming growth factor beta-activated kinase 1 (TAK1)-inhibitory activities of (5Z)-7-oxozeaenol analogues. Bioorg Med Chem23:6993-9 (2015) 
 
Mitogen-activated protein kinase kinase kinase 7
Name:Mitogen-activated protein kinase kinase kinase 7
Type:Protein
Mol. Mass.:67199.89
Organism:Homo sapiens (Human)
Description:O43318
Residue:606
BDBM50042034
NameBDBM50042034
Synonyms:(5Z)-7-Oxozeaenol CHEBI:67559 | CHEMBL1077979
TypeSmall organic molecule
Emp. Form.C19H22O7
Mol. Mass.362.3738
SMILESCOc1cc(O)c2c(c1)\C=C\C[C@H](O)[C@H](O)C(=O)\C=C/C[C@H](C)OC2=O