Reaction Details
TargetMuscarinic acetylcholine receptor M1
LigandBDBM50129251
Substrate/Competitorn/a
Meas. Tech.ChEMBL_1523364 (CHEMBL3630284)
Ki 3440±n/a nM
Citation Lee, NRZhang, XDarna, MDwoskin, LPZheng, G Muscarinic acetylcholine receptor binding affinities of pethidine analogs. Bioorg Med Chem Lett25:5032-5 (2015) 
 
Muscarinic acetylcholine receptor M1
Name:Muscarinic acetylcholine receptor M1
Type:Protein
Mol. Mass.:51442.54
Organism:Homo sapiens (Human)
Description:P11229
Residue:460
BDBM50129251
NameBDBM50129251
Synonyms:CHEMBL3627739
TypeSmall organic molecule
Emp. Form.C23H30N2O2
Mol. Mass.366.4965
SMILESCOc1ccc(CCC(=O)NCC2(CCN(C)CC2)c2ccccc2)cc1