Reaction Details
TargetMuscarinic acetylcholine receptor M5
LigandBDBM50129179
Substrate/Competitorn/a
Meas. Tech.ChEMBL_1523366 (CHEMBL3630286)
Ki 870±n/a nM
Citation Lee, NRZhang, XDarna, MDwoskin, LPZheng, G Muscarinic acetylcholine receptor binding affinities of pethidine analogs. Bioorg Med Chem Lett25:5032-5 (2015) 
 
Muscarinic acetylcholine receptor M5
Name:Muscarinic acetylcholine receptor M5
Type:PROTEIN
Mol. Mass.:60102.35
Organism:Homo sapiens (Human)
Description:ChEMBL_1517990
Residue:532
BDBM50129179
NameBDBM50129179
Synonyms:CHEMBL3629530
TypeSmall organic molecule
Emp. Form.C22H27NO3
Mol. Mass.353.4547
SMILESCOc1ccc(CCOC(=O)C2(CCN(C)CC2)c2ccccc2)cc1