Reaction Details
TargetcAMP and cAMP-inhibited cGMP 3',5'-cyclic phosphodiesterase 10A
LigandBDBM50129261
Substrate/Competitorn/a
Meas. Tech.ChEMBL_1523367 (CHEMBL3630287)
IC50 0.120000±n/a nM
Citation Yoshikawa, MKamisaki, HKunitomo, JOki, HKokubo, HSuzuki, AIkemoto, TNakashima, KKamiguchi, NHarada, AKimura, HTaniguchi, T Design and synthesis of a novel 2-oxindole scaffold as a highly potent and brain-penetrant phosphodiesterase 10A inhibitor. Bioorg Med Chem23:7138-49 (2015) 
 
cAMP and cAMP-inhibited cGMP 3',5'-cyclic phosphodiesterase 10A
Name:cAMP and cAMP-inhibited cGMP 3',5'-cyclic phosphodiesterase 10A
Type:Protein
Mol. Mass.:88412.52
Organism:Homo sapiens (Human)
Description:Q9Y233
Residue:779
BDBM50129261
NameBDBM50129261
Synonyms:CHEMBL3629734
TypeSmall organic molecule
Emp. Form.C28H26FN5O3
Mol. Mass.499.5361
SMILESCOc1cn(nc(-c2ccnn2-c2ccccc2)c1=O)-c1ccc2N(C3CCC3)C(=O)C(C)(C)c2c1F