Reaction Details
TargetBeta-secretase 1
LigandBDBM50129293
Substrate/Competitorn/a
Meas. Tech.ChEMBL_1523399 (CHEMBL3630426)
pH6.4±n/a
Ki 1500±n/a nM
Commentsextracted
Citation Boy, KMGuernon, JMWu, YJZhang, YShi, JZhai, WZhu, SGerritz, SWToyn, JHMeredith, JEBarten, DMBurton, CRAlbright, CFGood, ACGrace, JELentz, KAOlson, REMacor, JEThompson, LA Macrocyclic prolinyl acyl guanidines as inhibitors of฿-secretase (BACE). Bioorg Med Chem Lett25:5040-7 (2015) 
 
Beta-secretase 1
Name:Beta-secretase 1
Type:Protein
Mol. Mass.:55755.10
Organism:Homo sapiens (Human)
Description:P56817
Residue:501
BDBM50129293
NameBDBM50129293
Synonyms:CHEMBL3628124
TypeSmall organic molecule
Emp. Form.C25H28Cl2N6O3
Mol. Mass.531.434
SMILES[H][C@@]12CCCN1c1ccc(OC\C=C\CNCC(=O)Nc3c(Cl)cc(CN\C(N)=N\C2=O)cc3Cl)cc1