Reaction Details
TargetPotassium voltage-gated channel subfamily H member 2
LigandBDBM50129297
Substrate/Competitorn/a
Meas. Tech.ChEMBL_1523405 (CHEMBL3630432)
IC50>13000±n/a nM
Citation Boy, KMGuernon, JMWu, YJZhang, YShi, JZhai, WZhu, SGerritz, SWToyn, JHMeredith, JEBarten, DMBurton, CRAlbright, CFGood, ACGrace, JELentz, KAOlson, REMacor, JEThompson, LA Macrocyclic prolinyl acyl guanidines as inhibitors of฿-secretase (BACE). Bioorg Med Chem Lett25:5040-7 (2015) 
 
Potassium voltage-gated channel subfamily H member 2
Name:Potassium voltage-gated channel subfamily H member 2
Type:Multi-pass membrane protein
Mol. Mass.:126672.65
Organism:Homo sapiens (Human)
Description:Q12809
Residue:1159
BDBM50129297
NameBDBM50129297
Synonyms:CHEMBL3628127
TypeSmall organic molecule
Emp. Form.C27H32Cl2N6O3
Mol. Mass.559.487
SMILES[H][C@@]12CCCN1c1ccc(OC\C=C\CCCNCC(=O)Nc3c(Cl)cc(CN\C(N)=N\C2=O)cc3Cl)cc1