Reaction Details
TargetBeta-secretase 1
LigandBDBM50129294
Substrate/Competitorn/a
Meas. Tech.ChEMBL_1523401 (CHEMBL3630428)
EC50 230±n/a nM
Citation Boy, KMGuernon, JMWu, YJZhang, YShi, JZhai, WZhu, SGerritz, SWToyn, JHMeredith, JEBarten, DMBurton, CRAlbright, CFGood, ACGrace, JELentz, KAOlson, REMacor, JEThompson, LA Macrocyclic prolinyl acyl guanidines as inhibitors of฿-secretase (BACE). Bioorg Med Chem Lett25:5040-7 (2015) 
 
Beta-secretase 1
Name:Beta-secretase 1
Type:Protein
Mol. Mass.:55755.10
Organism:Homo sapiens (Human)
Description:P56817
Residue:501
BDBM50129294
NameBDBM50129294
Synonyms:CHEMBL3628125
TypeSmall organic molecule
Emp. Form.C26H30Cl2N6O3
Mol. Mass.545.461
SMILES[H][C@@]12CCCN1c1ccc(OC\C=C\CCNCC(=O)Nc3c(Cl)cc(CN\C(N)=N\C2=O)cc3Cl)cc1