Reaction Details
TargetBeta-secretase 1
LigandBDBM50129381
Substrate/Competitorn/a
Meas. Tech.ChEMBL_1523398 (CHEMBL3630425)
pH5±n/a
Ki 790±n/a nM
Commentsextracted
Citation Boy, KMGuernon, JMWu, YJZhang, YShi, JZhai, WZhu, SGerritz, SWToyn, JHMeredith, JEBarten, DMBurton, CRAlbright, CFGood, ACGrace, JELentz, KAOlson, REMacor, JEThompson, LA Macrocyclic prolinyl acyl guanidines as inhibitors of฿-secretase (BACE). Bioorg Med Chem Lett25:5040-7 (2015) 
 
Beta-secretase 1
Name:Beta-secretase 1
Type:Protein
Mol. Mass.:55755.10
Organism:Homo sapiens (Human)
Description:P56817
Residue:501
BDBM50129381
NameBDBM50129381
Synonyms:CHEMBL3627971
TypeSmall organic molecule
Emp. Form.C21H23Cl2N5O3
Mol. Mass.464.345
SMILESCC(=O)Nc1c(Cl)cc(CN\C(N)=N\C(=O)[C@@H]2C[C@H](O)CN2c2ccccc2)cc1Cl