Reaction Details
TargetCarbonic anhydrase 2
LigandBDBM9461
Substrate/Competitorn/a
Meas. Tech.ChEBML_1523541
Temperature298.15±n/a K
Ki>10000±n/a nM
Commentsextracted
Citation Karioti, ACeruso, MCarta, FBilia, ARSupuran, CT New natural product carbonic anhydrase inhibitors incorporating phenol moieties. Bioorg Med Chem23:7219-25 (2015) 
 
Carbonic anhydrase 2
Name:Carbonic anhydrase 2
Type:Enzyme
Mol. Mass.:29250.71
Organism:Homo sapiens (Human)
Description:P00918
Residue:260
BDBM9461
NameBDBM9461
Synonyms:5,7-dihydroxy-3-(4-methoxyphenyl)-4H-chromen-4-one Biochanin A (BCA) CHEMBL131921 | cid_5280373
TypeSmall organic molecule
Emp. Form.C16H12O5
Mol. Mass.284.2635
SMILESCOc1ccc(cc1)-c1coc2cc(O)cc(O)c2c1=O