Reaction Details
TargetCarbonic anhydrase 2
LigandBDBM50241354
Substrate/Competitorn/a
Meas. Tech.ChEBML_1523541
Temperature298.15±n/a K
Ki 6210±n/a nM
Commentsextracted
Citation Karioti, ACeruso, MCarta, FBilia, ARSupuran, CT New natural product carbonic anhydrase inhibitors incorporating phenol moieties. Bioorg Med Chem23:7219-25 (2015) 
 
Carbonic anhydrase 2
Name:Carbonic anhydrase 2
Type:Enzyme
Mol. Mass.:29250.71
Organism:Homo sapiens (Human)
Description:P00918
Residue:260
BDBM50241354
NameBDBM50241354
Synonyms:2-(3,4-Dihydroxy-phenyl)-5,7-dihydroxy-3-(3,4,5-trihydroxy-6-hydroxymethyl-tetrahydro-pyran-2-yloxy)-chromen-4-one 2-(3,4-dihydroxyphenyl)-5,7-dihydroxy-3-((2S,3R,4S,5S,6R)-3,4,5-trihydroxy-6-(hydroxymethyl)-tetrahydro-2H-pyran-2-yloxy)-4H-chromen-4-one 3,3',4',5,7-pentahydroxyflavone-3-beta-O-glucoside CHEMBL250450 Hyperoside Quercetin 3-O-beta-D-glucoside Quercetin-3-glucoside cid_5378597 hydroside isoquercetrin quercetin 3-O-beta-D-galactopyranoside quercetin 3-O-galactoside quercetin 3-O-glucoside | quercetin-3-galactoside
TypeSmall organic molecule
Emp. Form.C21H20O12
Mol. Mass.464.3763
SMILESOC[C@H]1O[C@@H](Oc2c(O)c3c(cc(O)cc3=O)oc2-c2ccc(O)c(O)c2)[C@H](O)[C@@H](O)[C@@H]1O