Reaction Details
TargetCarbonic anhydrase 2
LigandBDBM50250808
Substrate/Competitorn/a
Meas. Tech.ChEBML_1523541
Temperature298.15±n/a K
Ki>10000±n/a nM
Commentsextracted
Citation Karioti, ACeruso, MCarta, FBilia, ARSupuran, CT New natural product carbonic anhydrase inhibitors incorporating phenol moieties. Bioorg Med Chem23:7219-25 (2015) 
 
Carbonic anhydrase 2
Name:Carbonic anhydrase 2
Type:Enzyme
Mol. Mass.:29250.71
Organism:Homo sapiens (Human)
Description:P00918
Residue:260
BDBM50250808
NameBDBM50250808
Synonyms:CHEMBL518243 | lithospermic acid
TypeSmall organic molecule
Emp. Form.C27H22O12
Mol. Mass.538.4564
SMILESOC(=O)[C@@H](Cc1ccc(O)c(O)c1)OC(=O)\C=C\c1ccc(O)c2O[C@@H]([C@@H](C(O)=O)c12)c1ccc(O)c(O)c1