Reaction Details
TargetCarbonic anhydrase 4
LigandBDBM23409
Substrate/Competitorn/a
Meas. Tech.ChEBML_1523542
Temperature298.15±n/a K
Ki 213±n/a nM
Commentsextracted
Citation Karioti, ACeruso, MCarta, FBilia, ARSupuran, CT New natural product carbonic anhydrase inhibitors incorporating phenol moieties. Bioorg Med Chem23:7219-25 (2015) 
 
Carbonic anhydrase 4
Name:Carbonic anhydrase 4
Type:Enzyme
Mol. Mass.:35037.98
Organism:Homo sapiens (Human)
Description:P22748
Residue:312
BDBM23409
NameBDBM23409
Synonyms:3,5,7-trihydroxy-2-(4-hydroxy-3-methoxyphenyl)-4H-chromen-4-one Isorhamnetin | Isorhamnetin (17)
Typeflavonol
Emp. Form.C16H12O7
Mol. Mass.316.2623
SMILESCOc1cc(ccc1O)-c1oc2cc(O)cc(O)c2c(=O)c1O