Reaction Details
TargetCarbonic anhydrase 4
LigandBDBM50414250
Substrate/Competitorn/a
Meas. Tech.ChEBML_1523542
Temperature298.15±n/a K
Ki 67±n/a nM
Commentsextracted
Citation Karioti, ACeruso, MCarta, FBilia, ARSupuran, CT New natural product carbonic anhydrase inhibitors incorporating phenol moieties. Bioorg Med Chem23:7219-25 (2015) 
 
Carbonic anhydrase 4
Name:Carbonic anhydrase 4
Type:Enzyme
Mol. Mass.:35037.98
Organism:Homo sapiens (Human)
Description:P22748
Residue:312
BDBM50414250
NameBDBM50414250
Synonyms:CHEMBL457077
TypeSmall organic molecule
Emp. Form.C26H22O10
Mol. Mass.494.4469
SMILESOC(=O)[C@@H](Cc1ccc(O)c(O)c1)OC(=O)\C=C\c1ccc(O)c(O)c1\C=C\c1ccc(O)c(O)c1