Reaction Details
TargetCarbonic anhydrase 7
LigandBDBM50241243
Substrate/Competitorn/a
Meas. Tech.ChEBML_1523543
Temperature298.15±n/a K
Ki 424±n/a nM
Commentsextracted
Citation Karioti, ACeruso, MCarta, FBilia, ARSupuran, CT New natural product carbonic anhydrase inhibitors incorporating phenol moieties. Bioorg Med Chem23:7219-25 (2015) 
 
Carbonic anhydrase 7
Name:Carbonic anhydrase 7
Type:Enzyme
Mol. Mass.:29664.11
Organism:Homo sapiens (Human)
Description:Human cloned isozyme.
Residue:264
BDBM50241243
NameBDBM50241243
Synonyms:3,4',5,7-Tetrahydroxyflavone-3-glucoside 4H-1-Benzopyran-4-one, 3-(beta-D-glucopyranosyloxy)-5,7-dihydroxy-2-(4-hydroxyphenyl)- Astragalin cid_5282102 | kaempferol 3-O-glucoside
TypeSmall organic molecule
Emp. Form.C21H20O11
Mol. Mass.448.3769
SMILESOC[C@H]1O[C@@H](Oc2c(O)c3c(cc(O)cc3=O)oc2-c2ccc(O)cc2)[C@H](O)[C@@H](O)[C@@H]1O