Reaction Details
TargetCarbonic anhydrase 12
LigandBDBM50414250
Substrate/Competitorn/a
Meas. Tech.ChEBML_1523544
Temperature298.15±n/a K
Ki 40±n/a nM
Commentsextracted
Citation Karioti, ACeruso, MCarta, FBilia, ARSupuran, CT New natural product carbonic anhydrase inhibitors incorporating phenol moieties. Bioorg Med Chem23:7219-25 (2015) 
 
Carbonic anhydrase 12
Name:Carbonic anhydrase 12
Type:Enzyme
Mol. Mass.:39456.00
Organism:Homo sapiens (Human)
Description:Catalytic domain of human cloned isozyme was used in the assay
Residue:354
BDBM50414250
NameBDBM50414250
Synonyms:CHEMBL457077
TypeSmall organic molecule
Emp. Form.C26H22O10
Mol. Mass.494.4469
SMILESOC(=O)[C@@H](Cc1ccc(O)c(O)c1)OC(=O)\C=C\c1ccc(O)c(O)c1\C=C\c1ccc(O)c(O)c1