Reaction Details
TargetCarbonic anhydrase 1
LigandBDBM23409
Substrate/Competitorn/a
Meas. Tech.ChEMBL_1523540 (CHEMBL3631188)
Temperature298.15±n/a K
Ki>10000±n/a nM
Commentsextracted
Citation Karioti, ACeruso, MCarta, FBilia, ARSupuran, CT New natural product carbonic anhydrase inhibitors incorporating phenol moieties. Bioorg Med Chem23:7219-25 (2015) 
 
Carbonic anhydrase 1
Name:Carbonic anhydrase 1
Type:Enzyme
Mol. Mass.:28873.37
Organism:Homo sapiens (Human)
Description:P00915
Residue:261
BDBM23409
NameBDBM23409
Synonyms:3,5,7-trihydroxy-2-(4-hydroxy-3-methoxyphenyl)-4H-chromen-4-one Isorhamnetin | Isorhamnetin (17)
Typeflavonol
Emp. Form.C16H12O7
Mol. Mass.316.2623
SMILESCOc1cc(ccc1O)-c1oc2cc(O)cc(O)c2c(=O)c1O