Reaction Details
TargetBotulinum neurotoxin type A
LigandBDBM50129806
Substrate/Competitorn/a
Meas. Tech.ChEMBL_1523898 (CHEMBL3630043)
Ki 162±n/a nM
Citation Kumaran, DAdler, MLevit, MKrebs, MSweeney, RSwaminathan, S Interactions of a potent cyclic peptide inhibitor with the light chain of botulinum neurotoxin A: Insights from X-ray crystallography. Bioorg Med Chem23:7264-73 (2015) 
 
Botulinum neurotoxin type A
Name:Botulinum neurotoxin type A
Type:PROTEIN
Mol. Mass.:149450.01
Organism:Clostridium botulinum
Description:ChEMBL_1510137
Residue:1296
BDBM50129806
NameBDBM50129806
Synonyms:CHEMBL3627987
TypeSmall organic molecule
Emp. Form.C43H71N15O9S2
Mol. Mass.1006.249
SMILES[H][C@]1(NC(=O)[C@H](Cc2cc3ccccc3[nH]2)NC(=O)[C@H](CCCNC(N)=N)NC(=O)[C@@H](N)CCNC(=O)[C@@H](N)CSSC[C@H](NC(=O)[C@H](CCCCN)NC1=O)C(=O)N[C@@H](CC(C)C)C(N)=O)[C@H](C)O