Reaction Details
TargetcAMP-specific 3',5'-cyclic phosphodiesterase 4B
LigandBDBM14361
Substrate/Competitorn/a
Meas. Tech.ChEMBL_1524081 (CHEMBL3630866)
IC50 86±n/a nM
Citation Zhou, ZZGe, BCChen, YFShi, XDYang, XMXu, JP Catecholic amides as potential selective phosphodiesterase 4D inhibitors: Design, synthesis, pharmacological evaluation and structure-activity relationships. Bioorg Med Chem23:7332-9 (2015) 
 
cAMP-specific 3',5'-cyclic phosphodiesterase 4B
Name:cAMP-specific 3',5'-cyclic phosphodiesterase 4B
Type:Protein
Mol. Mass.:83318.87
Organism:Homo sapiens (Human)
Description:Q07343
Residue:736
BDBM14361
NameBDBM14361
Synonyms:(R,S)-Rolipram 4-[3-(cyclopentyloxy)-4-methoxyphenyl]pyrrolidin-2-one CHEMBL63 | Rolipram
TypeSmall organic molecule
Emp. Form.C16H21NO3
Mol. Mass.275.3428
SMILESCOc1ccc(cc1OC1CCCC1)C1CNC(=O)C1