Reaction Details
TargetcGMP-specific 3',5'-cyclic phosphodiesterase
LigandBDBM50129817
Substrate/Competitorn/a
Meas. Tech.ChEMBL_1524107 (CHEMBL3631048)
IC50>100000±n/a nM
Citation Zhou, ZZGe, BCChen, YFShi, XDYang, XMXu, JP Catecholic amides as potential selective phosphodiesterase 4D inhibitors: Design, synthesis, pharmacological evaluation and structure-activity relationships. Bioorg Med Chem23:7332-9 (2015) 
 
cGMP-specific 3',5'-cyclic phosphodiesterase
Name:cGMP-specific 3',5'-cyclic phosphodiesterase
Type:Protein
Mol. Mass.:99975.83
Organism:Homo sapiens (Human)
Description:O76074
Residue:875
BDBM50129817
NameBDBM50129817
Synonyms:CHEMBL3628685
TypeSmall organic molecule
Emp. Form.C21H23F2NO4
Mol. Mass.391.4084
SMILESCOc1ccc(CNC(=O)c2ccc(OC(F)F)c(OC3CCCC3)c2)cc1