Reaction Details
TargetDual 3',5'-cyclic-AMP and -GMP phosphodiesterase 11A
LigandBDBM50129817
Substrate/Competitorn/a
Meas. Tech.ChEMBL_1524113 (CHEMBL3631054)
IC50>100000±n/a nM
Citation Zhou, ZZGe, BCChen, YFShi, XDYang, XMXu, JP Catecholic amides as potential selective phosphodiesterase 4D inhibitors: Design, synthesis, pharmacological evaluation and structure-activity relationships. Bioorg Med Chem23:7332-9 (2015) 
 
Dual 3',5'-cyclic-AMP and -GMP phosphodiesterase 11A
Name:Dual 3',5'-cyclic-AMP and -GMP phosphodiesterase 11A
Type:Enzyme
Mol. Mass.:104751.53
Organism:Homo sapiens (Human)
Description:Q9HCR9
Residue:933
BDBM50129817
NameBDBM50129817
Synonyms:CHEMBL3628685
TypeSmall organic molecule
Emp. Form.C21H23F2NO4
Mol. Mass.391.4084
SMILESCOc1ccc(CNC(=O)c2ccc(OC(F)F)c(OC3CCCC3)c2)cc1