Reaction Details
TargetEpidermal growth factor receptor
LigandBDBM50129832
Substrate/Competitorn/a
Meas. Tech.ChEMBL_1524114 (CHEMBL3631055)
IC50 590±n/a nM
Citation Ravez, SArsenlis, SBarczyk, ADupont, AFrédérick, RHesse, SKirsch, GDepreux, PGoossens, L Synthesis and biological evaluation of di-aryl urea derivatives as c-Kit inhibitors. Bioorg Med Chem23:7340-7 (2015) 
 
Epidermal growth factor receptor
Name:Epidermal growth factor receptor
Type:Receptor Kinase Domain
Mol. Mass.:134279.59
Organism:Homo sapiens (Human)
Description:P00533
Residue:1210
BDBM50129832
NameBDBM50129832
Synonyms:CHEMBL3628800
TypeSmall organic molecule
Emp. Form.C14H8ClFN2O
Mol. Mass.274.678
SMILESFc1ccc(Oc2ncnc3ccccc23)cc1Cl