Reaction Details
TargetVascular endothelial growth factor receptor 1
LigandBDBM50129829
Substrate/Competitorn/a
Meas. Tech.ChEMBL_1524119 (CHEMBL3631060)
IC50 5750±n/a nM
Citation Ravez, SArsenlis, SBarczyk, ADupont, AFrédérick, RHesse, SKirsch, GDepreux, PGoossens, L Synthesis and biological evaluation of di-aryl urea derivatives as c-Kit inhibitors. Bioorg Med Chem23:7340-7 (2015) 
 
Vascular endothelial growth factor receptor 1
Name:Vascular endothelial growth factor receptor 1
Type:Receptor Tyrosine Kinase
Mol. Mass.:150800.23
Organism:Homo sapiens (Human)
Description:P17948
Residue:1338
BDBM50129829
NameBDBM50129829
Synonyms:CHEMBL3628797
TypeSmall organic molecule
Emp. Form.C21H16BrN5O
Mol. Mass.434.289
SMILESBrc1cccc(NC(=O)Nc2ccc(Nc3ncnc4ccccc34)cc2)c1