Reaction Details
TargetVascular endothelial growth factor receptor 1
LigandBDBM50129831
Substrate/Competitorn/a
Meas. Tech.ChEMBL_1524119 (CHEMBL3631060)
IC50 7150±n/a nM
Citation Ravez, SArsenlis, SBarczyk, ADupont, AFrédérick, RHesse, SKirsch, GDepreux, PGoossens, L Synthesis and biological evaluation of di-aryl urea derivatives as c-Kit inhibitors. Bioorg Med Chem23:7340-7 (2015) 
 
Vascular endothelial growth factor receptor 1
Name:Vascular endothelial growth factor receptor 1
Type:Receptor Tyrosine Kinase
Mol. Mass.:150800.23
Organism:Homo sapiens (Human)
Description:P17948
Residue:1338
BDBM50129831
NameBDBM50129831
Synonyms:CHEMBL3628799
TypeSmall organic molecule
Emp. Form.C23H20BrN5OS
Mol. Mass.494.407
SMILESBrc1cccc(NC(=O)Nc2ccc(Nc3ncnc4sc5CCCCc5c34)cc2)c1