Reaction Details
TargetVascular endothelial growth factor receptor 1
LigandBDBM50129839
Substrate/Competitorn/a
Meas. Tech.ChEMBL_1524119 (CHEMBL3631060)
IC50 1080±n/a nM
Citation Ravez, SArsenlis, SBarczyk, ADupont, AFrédérick, RHesse, SKirsch, GDepreux, PGoossens, L Synthesis and biological evaluation of di-aryl urea derivatives as c-Kit inhibitors. Bioorg Med Chem23:7340-7 (2015) 
 
Vascular endothelial growth factor receptor 1
Name:Vascular endothelial growth factor receptor 1
Type:Receptor Tyrosine Kinase
Mol. Mass.:150800.23
Organism:Homo sapiens (Human)
Description:P17948
Residue:1338
BDBM50129839
NameBDBM50129839
Synonyms:CHEMBL3628808
TypeSmall organic molecule
Emp. Form.C19H13BrN4O2S
Mol. Mass.441.301
SMILESBrc1cccc(NC(=O)Nc2ccc(Oc3ncnc4sccc34)cc2)c1