Reaction Details
TargetVascular endothelial growth factor receptor 3
LigandBDBM50129837
Substrate/Competitorn/a
Meas. Tech.ChEMBL_1524120 (CHEMBL3631061)
IC50 1020±n/a nM
Citation Ravez, SArsenlis, SBarczyk, ADupont, AFrédérick, RHesse, SKirsch, GDepreux, PGoossens, L Synthesis and biological evaluation of di-aryl urea derivatives as c-Kit inhibitors. Bioorg Med Chem23:7340-7 (2015) 
 
Vascular endothelial growth factor receptor 3
Name:Vascular endothelial growth factor receptor 3
Type:Protein
Mol. Mass.:152749.58
Organism:Homo sapiens (Human)
Description:P35916-2
Residue:1363
BDBM50129837
NameBDBM50129837
Synonyms:CHEMBL3628811
TypeSmall organic molecule
Emp. Form.C23H19BrN4O2S
Mol. Mass.495.392
SMILESBrc1cccc(NC(=O)Nc2ccc(Oc3ncnc4sc5CCCCc5c34)cc2)c1