Reaction Details
TargetPlatelet-derived growth factor receptor beta
LigandBDBM50129839
Substrate/Competitorn/a
Meas. Tech.ChEMBL_1524121 (CHEMBL3631062)
IC50 570±n/a nM
Citation Ravez, SArsenlis, SBarczyk, ADupont, AFrédérick, RHesse, SKirsch, GDepreux, PGoossens, L Synthesis and biological evaluation of di-aryl urea derivatives as c-Kit inhibitors. Bioorg Med Chem23:7340-7 (2015) 
 
Platelet-derived growth factor receptor beta
Name:Platelet-derived growth factor receptor beta
Type:Enzyme
Mol. Mass.:123922.25
Organism:Homo sapiens (Human)
Description:P09619
Residue:1106
BDBM50129839
NameBDBM50129839
Synonyms:CHEMBL3628808
TypeSmall organic molecule
Emp. Form.C19H13BrN4O2S
Mol. Mass.441.301
SMILESBrc1cccc(NC(=O)Nc2ccc(Oc3ncnc4sccc34)cc2)c1