Reaction Details
TargetMast/stem cell growth factor receptor Kit
LigandBDBM50129830
Substrate/Competitorn/a
Meas. Tech.ChEMBL_1524122 (CHEMBL3631063)
IC50 1.000000±n/a nM
Citation Ravez, SArsenlis, SBarczyk, ADupont, AFrédérick, RHesse, SKirsch, GDepreux, PGoossens, L Synthesis and biological evaluation of di-aryl urea derivatives as c-Kit inhibitors. Bioorg Med Chem23:7340-7 (2015) 
 
Mast/stem cell growth factor receptor Kit
Name:Mast/stem cell growth factor receptor Kit
Type:Protein
Mol. Mass.:109869.37
Organism:Homo sapiens (Human)
Description:P10721
Residue:976
BDBM50129830
NameBDBM50129830
Synonyms:CHEMBL3628798
TypeSmall organic molecule
Emp. Form.C19H14BrN5OS
Mol. Mass.440.316
SMILESBrc1cccc(NC(=O)Nc2ccc(Nc3ncnc4sccc34)cc2)c1