Reaction Details
TargetRAF proto-oncogene serine/threonine-protein kinase
LigandBDBM50380485
Substrate/Competitorn/a
Meas. Tech.ChEMBL_1524117 (CHEMBL3631058)
IC50 930±n/a nM
Citation Ravez, SArsenlis, SBarczyk, ADupont, AFrédérick, RHesse, SKirsch, GDepreux, PGoossens, L Synthesis and biological evaluation of di-aryl urea derivatives as c-Kit inhibitors. Bioorg Med Chem23:7340-7 (2015) 
 
RAF proto-oncogene serine/threonine-protein kinase
Name:RAF proto-oncogene serine/threonine-protein kinase
Type:Serine/threonine-protein kinase
Mol. Mass.:73082.52
Organism:Homo sapiens (Human)
Description:P04049
Residue:648
BDBM50380485
NameBDBM50380485
Synonyms:CHEMBL2018882
TypeSmall organic molecule
Emp. Form.C23H19BrN4O4
Mol. Mass.495.325
SMILESCOc1cc2ncnc(Oc3ccc(NC(=O)Nc4cccc(Br)c4)cc3)c2cc1OC