Reaction Details
TargetHepatocyte growth factor receptor
LigandBDBM50380485
Substrate/Competitorn/a
Meas. Tech.ChEMBL_1524116 (CHEMBL3631057)
IC50 2310±n/a nM
Citation Ravez, SArsenlis, SBarczyk, ADupont, AFrédérick, RHesse, SKirsch, GDepreux, PGoossens, L Synthesis and biological evaluation of di-aryl urea derivatives as c-Kit inhibitors. Bioorg Med Chem23:7340-7 (2015) 
 
Hepatocyte growth factor receptor
Name:Hepatocyte growth factor receptor
Type:Protein
Mol. Mass.:155559.73
Organism:Homo sapiens (Human)
Description:P08581
Residue:1390
BDBM50380485
NameBDBM50380485
Synonyms:CHEMBL2018882
TypeSmall organic molecule
Emp. Form.C23H19BrN4O4
Mol. Mass.495.325
SMILESCOc1cc2ncnc(Oc3ccc(NC(=O)Nc4cccc(Br)c4)cc3)c2cc1OC