Reaction Details
TargetVascular endothelial growth factor receptor 2
LigandBDBM50380487
Substrate/Competitorn/a
Meas. Tech.ChEMBL_1524115 (CHEMBL3631056)
IC50 4.0±n/a nM
Citation Ravez, SArsenlis, SBarczyk, ADupont, AFrédérick, RHesse, SKirsch, GDepreux, PGoossens, L Synthesis and biological evaluation of di-aryl urea derivatives as c-Kit inhibitors. Bioorg Med Chem23:7340-7 (2015) 
 
Vascular endothelial growth factor receptor 2
Name:Vascular endothelial growth factor receptor 2
Type:Receptor Tyrosine Kinase
Mol. Mass.:151510.97
Organism:Homo sapiens (Human)
Description:P35968
Residue:1356
BDBM50380487
NameBDBM50380487
Synonyms:CHEMBL2018884
TypeSmall organic molecule
Emp. Form.C24H21BrN4O4
Mol. Mass.509.352
SMILESCOc1cc2ncnc(Oc3ccc(NC(=O)Nc4cccc(Br)c4)c(C)c3)c2cc1OC